{"text_format":"1","workbook":"xlsx","n_sheets":8,"sheets":["Config","Caja","BBVA","Banco 2","Banco 3","Banco 4","Banco 5","Tesorería consolidada"],"not_rendered":{"charts":0,"images":4,"macros":1,"external_links":0,"defined_names":1,"comments":0,"pivot_tables":0},"unopened":[],"bounds":{"document_bytes":16777216,"sheet_cells":100000,"rows_first":2000,"rows_last":500,"rows_between":2000,"halvings":0,"cell_chars":16384,"cell_head_chars":4096},"cells_cut":0,"cells_raw":0,"read":"whole","date_system":"1900"}

{"sheet":"Config","index":0,"n_rows":75,"n_cols":7,"rows_kept":75,"cut":false,"hidden":false,"merged":[[72,6,72,10],[73,6,73,10],[74,6,74,10],[67,6,67,10],[68,6,68,10],[69,6,69,10],[70,6,70,10],[71,6,71,10],[64,6,64,10],[65,6,65,10],[66,6,66,10],[62,6,62,10],[63,6,63,10],[59,6,59,10],[60,6,60,10],[61,6,61,10],[54,6,54,10],[55,6,55,10],[56,6,56,10],[57,6,57,10],[58,6,58,10],[49,6,49,10],[50,6,50,10],[51,6,51,10],[52,6,52,10],[53,6,53,10],[44,6,44,10],[45,6,45,10],[46,6,46,10],[47,6,47,10],[48,6,48,10],[39,6,39,10],[40,6,40,10],[41,6,41,10],[42,6,42,10],[43,6,43,10],[34,6,34,10],[35,6,35,10],[36,6,36,10],[37,6,37,10],[38,6,38,10],[29,6,29,10],[30,6,30,10],[31,6,31,10],[32,6,32,10],[33,6,33,10],[24,6,24,10],[25,6,25,10],[26,6,26,10],[27,6,27,10],[28,6,28,10],[19,6,19,10],[20,6,20,10],[21,6,21,10],[22,6,22,10],[23,6,23,10],[14,6,14,10],[15,6,15,10],[16,6,16,10],[17,6,17,10],[18,6,18,10],[9,6,9,10],[10,6,10,10],[11,6,11,10],[12,6,12,10],[13,6,13,10],[0,1,2,3],[5,6,5,10],[6,6,6,10],[7,6,7,10],[8,6,8,10]]}
[null,"CONFIGURACIÓN"]
[]
[]
[]
[null,null,"FECHAS",null,null,null,"TÍTULOS Y SUBTÍTULOS"]
[null,null,"Fecha de inicio","2020-03-29",null,"Título","Flujos de la actividad corriente"]
[null,null,"Periodicidad",null,2,1,"Cobros a clientes"]
[null,null,null,null,null,2,"Pagos a proveedores"]
{"$rows_left_out":68}
{"sheet":"Caja","index":1,"n_rows":76,"n_cols":26,"rows_kept":76,"cut":false,"hidden":false,"merged":[[0,1,2,3]]}
[null,{"$f":"Config!C18&\" (\"&INDEX(Config!C11:C14,Config!E7)&\")\"","v":"Caja (Semanal)"}]
[]
[null,null,null,null,"hasta…","hasta…","hasta…","hasta…","hasta…","hasta…","hasta…","hasta…","hasta…","hasta…","hasta…","hasta…","hasta…","hasta…","hasta…","hasta…","hasta…","hasta…","hasta…","hasta…","hasta…","hasta…"]
[null,null,null,null,{"$f":"Config!D6","v":"2020-03-29"},{"$f":"CHOOSE(Config!$E$7,E4+1,E4+7,EDATE(E4,1),EDATE(E4,3))","v":"2020-04-05"},{"$f":"CHOOSE(Config!$E$7,F4+1,F4+7,EDATE(F4,1),EDATE(F4,3))","v":"2020-04-12"},{"$f":"CHOOSE(Config!$E$7,G4+1,G4+7,EDATE(G4,1),EDATE(G4,3))","v":"2020-04-19"},{"$f":"CHOOSE(Config!$E$7,H4+1,H4+7,EDATE(H4,1),EDATE(H4,3))","v":"2020-04-26"},{"$f":"CHOOSE(Config!$E$7,I4+1,I4+7,EDATE(I4,1),EDATE(I4,3))","v":"2020-05-03"},{"$f":"CHOOSE(Config!$E$7,J4+1,J4+7,EDATE(J4,1),EDATE(J4,3))","v":"2020-05-10"},{"$f":"CHOOSE(Config!$E$7,K4+1,K4+7,EDATE(K4,1),EDATE(K4,3))","v":"2020-05-17"},{"$f":"CHOOSE(Config!$E$7,L4+1,L4+7,EDATE(L4,1),EDATE(L4,3))","v":"2020-05-24"},{"$f":"CHOOSE(Config!$E$7,M4+1,M4+7,EDATE(M4,1),EDATE(M4,3))","v":"2020-05-31"},{"$f":"CHOOSE(Config!$E$7,N4+1,N4+7,EDATE(N4,1),EDATE(N4,3))","v":"2020-06-07"},{"$f":"CHOOSE(Config!$E$7,O4+1,O4+7,EDATE(O4,1),EDATE(O4,3))","v":"2020-06-14"},{"$f":"CHOOSE(Config!$E$7,P4+1,P4+7,EDATE(P4,1),EDATE(P4,3))","v":"2020-06-21"},{"$f":"CHOOSE(Config!$E$7,Q4+1,Q4+7,EDATE(Q4,1),EDATE(Q4,3))","v":"2020-06-28"},{"$f":"CHOOSE(Config!$E$7,R4+1,R4+7,EDATE(R4,1),EDATE(R4,3))","v":"2020-07-05"},{"$f":"CHOOSE(Config!$E$7,S4+1,S4+7,EDATE(S4,1),EDATE(S4,3))","v":"2020-07-12"},{"$f":"CHOOSE(Config!$E$7,T4+1,T4+7,EDATE(T4,1),EDATE(T4,3))","v":"2020-07-19"},{"$f":"CHOOSE(Config!$E$7,U4+1,U4+7,EDATE(U4,1),EDATE(U4,3))","v":"2020-07-26"},{"$f":"CHOOSE(Config!$E$7,V4+1,V4+7,EDATE(V4,1),EDATE(V4,3))","v":"2020-08-02"},{"$f":"CHOOSE(Config!$E$7,W4+1,W4+7,EDATE(W4,1),EDATE(W4,3))","v":"2020-08-09"},{"$f":"CHOOSE(Config!$E$7,X4+1,X4+7,EDATE(X4,1),EDATE(X4,3))","v":"2020-08-16"},{"$f":"CHOOSE(Config!$E$7,Y4+1,Y4+7,EDATE(Y4,1),EDATE(Y4,3))","v":"2020-08-23"}]
[null,null,"±  Saldos iniciales en cada período",null,{"$f":"Config!D18","v":300},{"$f":"E76","v":2300},{"$f":"F76","v":2300},2300,2300,2300,2300,2300,2300,2300,2300,2300,2300,2300,2300,2300,2300,2300,2300,2300,2300,2300]
[null,null,{"$f":"IF(Config!G6<>\"\",Config!G6,\"\")","v":"Flujos de la actividad corriente"},null,{"$f":"SUBTOTAL(9,E7:E36)","v":2000},{"$f":"SUBTOTAL(9,F7:F36)","v":0},0,0,0,0,0,0,0,0,0,0,0,0,0,0,0,0,0,0,0,0]
[null,{"$f":"Config!F7","v":1},{"$f":"IF(Config!G7<>\"\",Config!G7,\"\")","v":"Cobros a clientes"},null,0,0,0,0,0,0,0,0,0,0,0,0,0,0,0,0,0,0,0,0,0,0]
[null,{"$f":"Config!F8","v":2},{"$f":"IF(Config!G8<>\"\",Config!G8,\"\")","v":"Pagos a proveedores"},null,0,0,0,0,0,0,0,0,0,0,0,0,0,0,0,0,0,0,0,0,0,0]
{"$rows_left_out":69}
{"sheet":"BBVA","index":2,"n_rows":76,"n_cols":26,"rows_kept":76,"cut":false,"hidden":false,"merged":[[0,1,2,3]]}
[null,{"$f":"Config!C19&\" (\"&INDEX(Config!C11:C14,Config!E7)&\")\"","v":"BBVA (Semanal)"}]
[]
[null,null,null,null,"hasta…","hasta…","hasta…","hasta…","hasta…","hasta…","hasta…","hasta…","hasta…","hasta…","hasta…","hasta…","hasta…","hasta…","hasta…","hasta…","hasta…","hasta…","hasta…","hasta…","hasta…","hasta…"]
[null,null,null,null,{"$f":"Config!D6","v":"2020-03-29"},{"$f":"CHOOSE(Config!$E$7,E4+1,E4+7,EDATE(E4,1),EDATE(E4,3))","v":"2020-04-05"},{"$f":"CHOOSE(Config!$E$7,F4+1,F4+7,EDATE(F4,1),EDATE(F4,3))","v":"2020-04-12"},{"$f":"CHOOSE(Config!$E$7,G4+1,G4+7,EDATE(G4,1),EDATE(G4,3))","v":"2020-04-19"},{"$f":"CHOOSE(Config!$E$7,H4+1,H4+7,EDATE(H4,1),EDATE(H4,3))","v":"2020-04-26"},{"$f":"CHOOSE(Config!$E$7,I4+1,I4+7,EDATE(I4,1),EDATE(I4,3))","v":"2020-05-03"},{"$f":"CHOOSE(Config!$E$7,J4+1,J4+7,EDATE(J4,1),EDATE(J4,3))","v":"2020-05-10"},{"$f":"CHOOSE(Config!$E$7,K4+1,K4+7,EDATE(K4,1),EDATE(K4,3))","v":"2020-05-17"},{"$f":"CHOOSE(Config!$E$7,L4+1,L4+7,EDATE(L4,1),EDATE(L4,3))","v":"2020-05-24"},{"$f":"CHOOSE(Config!$E$7,M4+1,M4+7,EDATE(M4,1),EDATE(M4,3))","v":"2020-05-31"},{"$f":"CHOOSE(Config!$E$7,N4+1,N4+7,EDATE(N4,1),EDATE(N4,3))","v":"2020-06-07"},{"$f":"CHOOSE(Config!$E$7,O4+1,O4+7,EDATE(O4,1),EDATE(O4,3))","v":"2020-06-14"},{"$f":"CHOOSE(Config!$E$7,P4+1,P4+7,EDATE(P4,1),EDATE(P4,3))","v":"2020-06-21"},{"$f":"CHOOSE(Config!$E$7,Q4+1,Q4+7,EDATE(Q4,1),EDATE(Q4,3))","v":"2020-06-28"},{"$f":"CHOOSE(Config!$E$7,R4+1,R4+7,EDATE(R4,1),EDATE(R4,3))","v":"2020-07-05"},{"$f":"CHOOSE(Config!$E$7,S4+1,S4+7,EDATE(S4,1),EDATE(S4,3))","v":"2020-07-12"},{"$f":"CHOOSE(Config!$E$7,T4+1,T4+7,EDATE(T4,1),EDATE(T4,3))","v":"2020-07-19"},{"$f":"CHOOSE(Config!$E$7,U4+1,U4+7,EDATE(U4,1),EDATE(U4,3))","v":"2020-07-26"},{"$f":"CHOOSE(Config!$E$7,V4+1,V4+7,EDATE(V4,1),EDATE(V4,3))","v":"2020-08-02"},{"$f":"CHOOSE(Config!$E$7,W4+1,W4+7,EDATE(W4,1),EDATE(W4,3))","v":"2020-08-09"},{"$f":"CHOOSE(Config!$E$7,X4+1,X4+7,EDATE(X4,1),EDATE(X4,3))","v":"2020-08-16"},{"$f":"CHOOSE(Config!$E$7,Y4+1,Y4+7,EDATE(Y4,1),EDATE(Y4,3))","v":"2020-08-23"}]
[null,null,"±  Saldos iniciales en cada período",null,{"$f":"Config!D19","v":1500},{"$f":"E76","v":-300},{"$f":"F76","v":-300},-300,-300,-300,-300,-300,-300,-300,-300,-300,-300,-300,-300,-300,-300,-300,-300,-300,-300,-300]
[null,null,{"$f":"IF(Config!G6<>\"\",Config!G6,\"\")","v":"Flujos de la actividad corriente"},null,{"$f":"SUBTOTAL(9,E7:E36)","v":-1800},{"$f":"SUBTOTAL(9,F7:F36)","v":0},0,0,0,0,0,0,0,0,0,0,0,0,0,0,0,0,0,0,0,0]
[null,{"$f":"Config!F7","v":1},{"$f":"IF(Config!G7<>\"\",Config!G7,\"\")","v":"Cobros a clientes"},null,1000,0,0,0,0,0,0,0,0,0,0,0,0,0,0,0,0,0,0,0,0,0]
[null,{"$f":"Config!F8","v":2},{"$f":"IF(Config!G8<>\"\",Config!G8,\"\")","v":"Pagos a proveedores"},null,-2300,0,0,0,0,0,0,0,0,0,0,0,0,0,0,0,0,0,0,0,0,0]
{"$rows_left_out":69}
{"sheet":"Banco 2","index":3,"n_rows":76,"n_cols":26,"rows_kept":76,"cut":false,"hidden":false,"merged":[[0,1,2,3]]}
[null,{"$f":"Config!C20&\" (\"&INDEX(Config!C11:C14,Config!E7)&\")\"","v":"Banco 2 (Semanal)"}]
[]
[null,null,null,null,"hasta…","hasta…","hasta…","hasta…","hasta…","hasta…","hasta…","hasta…","hasta…","hasta…","hasta…","hasta…","hasta…","hasta…","hasta…","hasta…","hasta…","hasta…","hasta…","hasta…","hasta…","hasta…"]
[null,null,null,null,{"$f":"Config!D6","v":"2020-03-29"},{"$f":"CHOOSE(Config!$E$7,E4+1,E4+7,EDATE(E4,1),EDATE(E4,3))","v":"2020-04-05"},{"$f":"CHOOSE(Config!$E$7,F4+1,F4+7,EDATE(F4,1),EDATE(F4,3))","v":"2020-04-12"},{"$f":"CHOOSE(Config!$E$7,G4+1,G4+7,EDATE(G4,1),EDATE(G4,3))","v":"2020-04-19"},{"$f":"CHOOSE(Config!$E$7,H4+1,H4+7,EDATE(H4,1),EDATE(H4,3))","v":"2020-04-26"},{"$f":"CHOOSE(Config!$E$7,I4+1,I4+7,EDATE(I4,1),EDATE(I4,3))","v":"2020-05-03"},{"$f":"CHOOSE(Config!$E$7,J4+1,J4+7,EDATE(J4,1),EDATE(J4,3))","v":"2020-05-10"},{"$f":"CHOOSE(Config!$E$7,K4+1,K4+7,EDATE(K4,1),EDATE(K4,3))","v":"2020-05-17"},{"$f":"CHOOSE(Config!$E$7,L4+1,L4+7,EDATE(L4,1),EDATE(L4,3))","v":"2020-05-24"},{"$f":"CHOOSE(Config!$E$7,M4+1,M4+7,EDATE(M4,1),EDATE(M4,3))","v":"2020-05-31"},{"$f":"CHOOSE(Config!$E$7,N4+1,N4+7,EDATE(N4,1),EDATE(N4,3))","v":"2020-06-07"},{"$f":"CHOOSE(Config!$E$7,O4+1,O4+7,EDATE(O4,1),EDATE(O4,3))","v":"2020-06-14"},{"$f":"CHOOSE(Config!$E$7,P4+1,P4+7,EDATE(P4,1),EDATE(P4,3))","v":"2020-06-21"},{"$f":"CHOOSE(Config!$E$7,Q4+1,Q4+7,EDATE(Q4,1),EDATE(Q4,3))","v":"2020-06-28"},{"$f":"CHOOSE(Config!$E$7,R4+1,R4+7,EDATE(R4,1),EDATE(R4,3))","v":"2020-07-05"},{"$f":"CHOOSE(Config!$E$7,S4+1,S4+7,EDATE(S4,1),EDATE(S4,3))","v":"2020-07-12"},{"$f":"CHOOSE(Config!$E$7,T4+1,T4+7,EDATE(T4,1),EDATE(T4,3))","v":"2020-07-19"},{"$f":"CHOOSE(Config!$E$7,U4+1,U4+7,EDATE(U4,1),EDATE(U4,3))","v":"2020-07-26"},{"$f":"CHOOSE(Config!$E$7,V4+1,V4+7,EDATE(V4,1),EDATE(V4,3))","v":"2020-08-02"},{"$f":"CHOOSE(Config!$E$7,W4+1,W4+7,EDATE(W4,1),EDATE(W4,3))","v":"2020-08-09"},{"$f":"CHOOSE(Config!$E$7,X4+1,X4+7,EDATE(X4,1),EDATE(X4,3))","v":"2020-08-16"},{"$f":"CHOOSE(Config!$E$7,Y4+1,Y4+7,EDATE(Y4,1),EDATE(Y4,3))","v":"2020-08-23"}]
[null,null,"±  Saldos iniciales en cada período",null,{"$f":"Config!D20","v":0},{"$f":"E76","v":0},{"$f":"F76","v":0},0,0,0,0,0,0,0,0,0,0,0,0,0,0,0,0,0,0,0]
[null,null,{"$f":"IF(Config!G6<>\"\",Config!G6,\"\")","v":"Flujos de la actividad corriente"},null,{"$f":"SUBTOTAL(9,E7:E36)","v":0},{"$f":"SUBTOTAL(9,F7:F36)","v":0},0,0,0,0,0,0,0,0,0,0,0,0,0,0,0,0,0,0,0,0]
[null,{"$f":"Config!F7","v":1},{"$f":"IF(Config!G7<>\"\",Config!G7,\"\")","v":"Cobros a clientes"},null,null,0,0,0,0,0,0,0,0,0,0,0,0,0,0,0,0,0,0,0,0,0]
[null,{"$f":"Config!F8","v":2},{"$f":"IF(Config!G8<>\"\",Config!G8,\"\")","v":"Pagos a proveedores"},null,0,0,0,0,0,0,0,0,0,0,0,0,0,0,0,0,0,0,0,0,0,0]
{"$rows_left_out":69}
{"sheet":"Banco 3","index":4,"n_rows":76,"n_cols":26,"rows_kept":76,"cut":false,"hidden":false,"merged":[[0,1,2,3]]}
[null,{"$f":"Config!C21&\" (\"&INDEX(Config!C11:C14,Config!E7)&\")\"","v":"Banco 3 (Semanal)"}]
[]
[null,null,null,null,"hasta…","hasta…","hasta…","hasta…","hasta…","hasta…","hasta…","hasta…","hasta…","hasta…","hasta…","hasta…","hasta…","hasta…","hasta…","hasta…","hasta…","hasta…","hasta…","hasta…","hasta…","hasta…"]
[null,null,null,null,{"$f":"Config!D6","v":"2020-03-29"},{"$f":"CHOOSE(Config!$E$7,E4+1,E4+7,EDATE(E4,1),EDATE(E4,3))","v":"2020-04-05"},{"$f":"CHOOSE(Config!$E$7,F4+1,F4+7,EDATE(F4,1),EDATE(F4,3))","v":"2020-04-12"},{"$f":"CHOOSE(Config!$E$7,G4+1,G4+7,EDATE(G4,1),EDATE(G4,3))","v":"2020-04-19"},{"$f":"CHOOSE(Config!$E$7,H4+1,H4+7,EDATE(H4,1),EDATE(H4,3))","v":"2020-04-26"},{"$f":"CHOOSE(Config!$E$7,I4+1,I4+7,EDATE(I4,1),EDATE(I4,3))","v":"2020-05-03"},{"$f":"CHOOSE(Config!$E$7,J4+1,J4+7,EDATE(J4,1),EDATE(J4,3))","v":"2020-05-10"},{"$f":"CHOOSE(Config!$E$7,K4+1,K4+7,EDATE(K4,1),EDATE(K4,3))","v":"2020-05-17"},{"$f":"CHOOSE(Config!$E$7,L4+1,L4+7,EDATE(L4,1),EDATE(L4,3))","v":"2020-05-24"},{"$f":"CHOOSE(Config!$E$7,M4+1,M4+7,EDATE(M4,1),EDATE(M4,3))","v":"2020-05-31"},{"$f":"CHOOSE(Config!$E$7,N4+1,N4+7,EDATE(N4,1),EDATE(N4,3))","v":"2020-06-07"},{"$f":"CHOOSE(Config!$E$7,O4+1,O4+7,EDATE(O4,1),EDATE(O4,3))","v":"2020-06-14"},{"$f":"CHOOSE(Config!$E$7,P4+1,P4+7,EDATE(P4,1),EDATE(P4,3))","v":"2020-06-21"},{"$f":"CHOOSE(Config!$E$7,Q4+1,Q4+7,EDATE(Q4,1),EDATE(Q4,3))","v":"2020-06-28"},{"$f":"CHOOSE(Config!$E$7,R4+1,R4+7,EDATE(R4,1),EDATE(R4,3))","v":"2020-07-05"},{"$f":"CHOOSE(Config!$E$7,S4+1,S4+7,EDATE(S4,1),EDATE(S4,3))","v":"2020-07-12"},{"$f":"CHOOSE(Config!$E$7,T4+1,T4+7,EDATE(T4,1),EDATE(T4,3))","v":"2020-07-19"},{"$f":"CHOOSE(Config!$E$7,U4+1,U4+7,EDATE(U4,1),EDATE(U4,3))","v":"2020-07-26"},{"$f":"CHOOSE(Config!$E$7,V4+1,V4+7,EDATE(V4,1),EDATE(V4,3))","v":"2020-08-02"},{"$f":"CHOOSE(Config!$E$7,W4+1,W4+7,EDATE(W4,1),EDATE(W4,3))","v":"2020-08-09"},{"$f":"CHOOSE(Config!$E$7,X4+1,X4+7,EDATE(X4,1),EDATE(X4,3))","v":"2020-08-16"},{"$f":"CHOOSE(Config!$E$7,Y4+1,Y4+7,EDATE(Y4,1),EDATE(Y4,3))","v":"2020-08-23"}]
[null,null,"±  Saldos iniciales en cada período",null,{"$f":"Config!D21","v":0},{"$f":"E76","v":0},{"$f":"F76","v":0},0,0,0,0,0,0,0,0,0,0,0,0,0,0,0,0,0,0,0]
[null,null,{"$f":"IF(Config!G6<>\"\",Config!G6,\"\")","v":"Flujos de la actividad corriente"},null,{"$f":"SUBTOTAL(9,E7:E36)","v":0},{"$f":"SUBTOTAL(9,F7:F36)","v":0},0,0,0,0,0,0,0,0,0,0,0,0,0,0,0,0,0,0,0,0]
[null,{"$f":"Config!F7","v":1},{"$f":"IF(Config!G7<>\"\",Config!G7,\"\")","v":"Cobros a clientes"},null,0,0,0,0,0,0,0,0,0,0,0,0,0,0,0,0,0,0,0,0,0,0]
[null,{"$f":"Config!F8","v":2},{"$f":"IF(Config!G8<>\"\",Config!G8,\"\")","v":"Pagos a proveedores"},null,0,0,0,0,0,0,0,0,0,0,0,0,0,0,0,0,0,0,0,0,0,0]
{"$rows_left_out":69}
{"sheet":"Banco 4","index":5,"n_rows":76,"n_cols":26,"rows_kept":76,"cut":false,"hidden":false,"merged":[[0,1,2,3]]}
[null,{"$f":"Config!C22&\" (\"&INDEX(Config!C11:C14,Config!E7)&\")\"","v":"Banco 4 (Semanal)"}]
[]
[null,null,null,null,"hasta…","hasta…","hasta…","hasta…","hasta…","hasta…","hasta…","hasta…","hasta…","hasta…","hasta…","hasta…","hasta…","hasta…","hasta…","hasta…","hasta…","hasta…","hasta…","hasta…","hasta…","hasta…"]
[null,null,null,null,{"$f":"Config!D6","v":"2020-03-29"},{"$f":"CHOOSE(Config!$E$7,E4+1,E4+7,EDATE(E4,1),EDATE(E4,3))","v":"2020-04-05"},{"$f":"CHOOSE(Config!$E$7,F4+1,F4+7,EDATE(F4,1),EDATE(F4,3))","v":"2020-04-12"},{"$f":"CHOOSE(Config!$E$7,G4+1,G4+7,EDATE(G4,1),EDATE(G4,3))","v":"2020-04-19"},{"$f":"CHOOSE(Config!$E$7,H4+1,H4+7,EDATE(H4,1),EDATE(H4,3))","v":"2020-04-26"},{"$f":"CHOOSE(Config!$E$7,I4+1,I4+7,EDATE(I4,1),EDATE(I4,3))","v":"2020-05-03"},{"$f":"CHOOSE(Config!$E$7,J4+1,J4+7,EDATE(J4,1),EDATE(J4,3))","v":"2020-05-10"},{"$f":"CHOOSE(Config!$E$7,K4+1,K4+7,EDATE(K4,1),EDATE(K4,3))","v":"2020-05-17"},{"$f":"CHOOSE(Config!$E$7,L4+1,L4+7,EDATE(L4,1),EDATE(L4,3))","v":"2020-05-24"},{"$f":"CHOOSE(Config!$E$7,M4+1,M4+7,EDATE(M4,1),EDATE(M4,3))","v":"2020-05-31"},{"$f":"CHOOSE(Config!$E$7,N4+1,N4+7,EDATE(N4,1),EDATE(N4,3))","v":"2020-06-07"},{"$f":"CHOOSE(Config!$E$7,O4+1,O4+7,EDATE(O4,1),EDATE(O4,3))","v":"2020-06-14"},{"$f":"CHOOSE(Config!$E$7,P4+1,P4+7,EDATE(P4,1),EDATE(P4,3))","v":"2020-06-21"},{"$f":"CHOOSE(Config!$E$7,Q4+1,Q4+7,EDATE(Q4,1),EDATE(Q4,3))","v":"2020-06-28"},{"$f":"CHOOSE(Config!$E$7,R4+1,R4+7,EDATE(R4,1),EDATE(R4,3))","v":"2020-07-05"},{"$f":"CHOOSE(Config!$E$7,S4+1,S4+7,EDATE(S4,1),EDATE(S4,3))","v":"2020-07-12"},{"$f":"CHOOSE(Config!$E$7,T4+1,T4+7,EDATE(T4,1),EDATE(T4,3))","v":"2020-07-19"},{"$f":"CHOOSE(Config!$E$7,U4+1,U4+7,EDATE(U4,1),EDATE(U4,3))","v":"2020-07-26"},{"$f":"CHOOSE(Config!$E$7,V4+1,V4+7,EDATE(V4,1),EDATE(V4,3))","v":"2020-08-02"},{"$f":"CHOOSE(Config!$E$7,W4+1,W4+7,EDATE(W4,1),EDATE(W4,3))","v":"2020-08-09"},{"$f":"CHOOSE(Config!$E$7,X4+1,X4+7,EDATE(X4,1),EDATE(X4,3))","v":"2020-08-16"},{"$f":"CHOOSE(Config!$E$7,Y4+1,Y4+7,EDATE(Y4,1),EDATE(Y4,3))","v":"2020-08-23"}]
[null,null,"±  Saldos iniciales en cada período",null,{"$f":"Config!D22","v":0},{"$f":"E76","v":0},{"$f":"F76","v":0},0,0,0,0,0,0,0,0,0,0,0,0,0,0,0,0,0,0,0]
[null,null,{"$f":"IF(Config!G6<>\"\",Config!G6,\"\")","v":"Flujos de la actividad corriente"},null,{"$f":"SUBTOTAL(9,E7:E36)","v":0},{"$f":"SUBTOTAL(9,F7:F36)","v":0},0,0,0,0,0,0,0,0,0,0,0,0,0,0,0,0,0,0,0,0]
[null,{"$f":"Config!F7","v":1},{"$f":"IF(Config!G7<>\"\",Config!G7,\"\")","v":"Cobros a clientes"},null,0,0,0,0,0,0,0,0,0,0,0,0,0,0,0,0,0,0,0,0,0,0]
[null,{"$f":"Config!F8","v":2},{"$f":"IF(Config!G8<>\"\",Config!G8,\"\")","v":"Pagos a proveedores"},null,0,0,0,0,0,0,0,0,0,0,0,0,0,0,0,0,0,0,0,0,0,0]
{"$rows_left_out":69}
{"sheet":"Banco 5","index":6,"n_rows":76,"n_cols":26,"rows_kept":76,"cut":false,"hidden":false,"merged":[[0,1,2,3]]}
[null,{"$f":"Config!C23&\" (\"&INDEX(Config!C11:C14,Config!E7)&\")\"","v":"Banco 5 (Semanal)"}]
[]
[null,null,null,null,"hasta…","hasta…","hasta…","hasta…","hasta…","hasta…","hasta…","hasta…","hasta…","hasta…","hasta…","hasta…","hasta…","hasta…","hasta…","hasta…","hasta…","hasta…","hasta…","hasta…","hasta…","hasta…"]
[null,null,null,null,{"$f":"Config!D6","v":"2020-03-29"},{"$f":"CHOOSE(Config!$E$7,E4+1,E4+7,EDATE(E4,1),EDATE(E4,3))","v":"2020-04-05"},{"$f":"CHOOSE(Config!$E$7,F4+1,F4+7,EDATE(F4,1),EDATE(F4,3))","v":"2020-04-12"},{"$f":"CHOOSE(Config!$E$7,G4+1,G4+7,EDATE(G4,1),EDATE(G4,3))","v":"2020-04-19"},{"$f":"CHOOSE(Config!$E$7,H4+1,H4+7,EDATE(H4,1),EDATE(H4,3))","v":"2020-04-26"},{"$f":"CHOOSE(Config!$E$7,I4+1,I4+7,EDATE(I4,1),EDATE(I4,3))","v":"2020-05-03"},{"$f":"CHOOSE(Config!$E$7,J4+1,J4+7,EDATE(J4,1),EDATE(J4,3))","v":"2020-05-10"},{"$f":"CHOOSE(Config!$E$7,K4+1,K4+7,EDATE(K4,1),EDATE(K4,3))","v":"2020-05-17"},{"$f":"CHOOSE(Config!$E$7,L4+1,L4+7,EDATE(L4,1),EDATE(L4,3))","v":"2020-05-24"},{"$f":"CHOOSE(Config!$E$7,M4+1,M4+7,EDATE(M4,1),EDATE(M4,3))","v":"2020-05-31"},{"$f":"CHOOSE(Config!$E$7,N4+1,N4+7,EDATE(N4,1),EDATE(N4,3))","v":"2020-06-07"},{"$f":"CHOOSE(Config!$E$7,O4+1,O4+7,EDATE(O4,1),EDATE(O4,3))","v":"2020-06-14"},{"$f":"CHOOSE(Config!$E$7,P4+1,P4+7,EDATE(P4,1),EDATE(P4,3))","v":"2020-06-21"},{"$f":"CHOOSE(Config!$E$7,Q4+1,Q4+7,EDATE(Q4,1),EDATE(Q4,3))","v":"2020-06-28"},{"$f":"CHOOSE(Config!$E$7,R4+1,R4+7,EDATE(R4,1),EDATE(R4,3))","v":"2020-07-05"},{"$f":"CHOOSE(Config!$E$7,S4+1,S4+7,EDATE(S4,1),EDATE(S4,3))","v":"2020-07-12"},{"$f":"CHOOSE(Config!$E$7,T4+1,T4+7,EDATE(T4,1),EDATE(T4,3))","v":"2020-07-19"},{"$f":"CHOOSE(Config!$E$7,U4+1,U4+7,EDATE(U4,1),EDATE(U4,3))","v":"2020-07-26"},{"$f":"CHOOSE(Config!$E$7,V4+1,V4+7,EDATE(V4,1),EDATE(V4,3))","v":"2020-08-02"},{"$f":"CHOOSE(Config!$E$7,W4+1,W4+7,EDATE(W4,1),EDATE(W4,3))","v":"2020-08-09"},{"$f":"CHOOSE(Config!$E$7,X4+1,X4+7,EDATE(X4,1),EDATE(X4,3))","v":"2020-08-16"},{"$f":"CHOOSE(Config!$E$7,Y4+1,Y4+7,EDATE(Y4,1),EDATE(Y4,3))","v":"2020-08-23"}]
[null,null,"±  Saldos iniciales en cada período",null,{"$f":"Config!D23","v":0},{"$f":"E76","v":0},{"$f":"F76","v":0},0,0,0,0,0,0,0,0,0,0,0,0,0,0,0,0,0,0,0]
[null,null,{"$f":"IF(Config!G6<>\"\",Config!G6,\"\")","v":"Flujos de la actividad corriente"},null,{"$f":"SUBTOTAL(9,E7:E36)","v":0},{"$f":"SUBTOTAL(9,F7:F36)","v":0},0,0,0,0,0,0,0,0,0,0,0,0,0,0,0,0,0,0,0,0]
[null,{"$f":"Config!F7","v":1},{"$f":"IF(Config!G7<>\"\",Config!G7,\"\")","v":"Cobros a clientes"},null,0,0,0,0,0,0,0,0,0,0,0,0,0,0,0,0,0,0,0,0,0,0]
[null,{"$f":"Config!F8","v":2},{"$f":"IF(Config!G8<>\"\",Config!G8,\"\")","v":"Pagos a proveedores"},null,0,0,0,0,0,0,0,0,0,0,0,0,0,0,0,0,0,0,0,0,0,0]
{"$rows_left_out":69}
{"sheet":"Tesorería consolidada","index":7,"n_rows":76,"n_cols":26,"rows_kept":76,"cut":false,"hidden":false,"merged":[[0,1,2,3]]}
[null,"Tesorería consolidada"]
[]
[null,null,null,null,"hasta…","hasta…","hasta…","hasta…","hasta…","hasta…","hasta…","hasta…","hasta…","hasta…","hasta…","hasta…","hasta…","hasta…","hasta…","hasta…","hasta…","hasta…","hasta…","hasta…","hasta…","hasta…"]
[null,null,null,null,{"$f":"Config!D6","v":"2020-03-29"},{"$f":"CHOOSE(Config!$E$7,E4+1,E4+7,EDATE(E4,1),EDATE(E4,3))","v":"2020-04-05"},{"$f":"CHOOSE(Config!$E$7,F4+1,F4+7,EDATE(F4,1),EDATE(F4,3))","v":"2020-04-12"},{"$f":"CHOOSE(Config!$E$7,G4+1,G4+7,EDATE(G4,1),EDATE(G4,3))","v":"2020-04-19"},{"$f":"CHOOSE(Config!$E$7,H4+1,H4+7,EDATE(H4,1),EDATE(H4,3))","v":"2020-04-26"},{"$f":"CHOOSE(Config!$E$7,I4+1,I4+7,EDATE(I4,1),EDATE(I4,3))","v":"2020-05-03"},{"$f":"CHOOSE(Config!$E$7,J4+1,J4+7,EDATE(J4,1),EDATE(J4,3))","v":"2020-05-10"},{"$f":"CHOOSE(Config!$E$7,K4+1,K4+7,EDATE(K4,1),EDATE(K4,3))","v":"2020-05-17"},{"$f":"CHOOSE(Config!$E$7,L4+1,L4+7,EDATE(L4,1),EDATE(L4,3))","v":"2020-05-24"},{"$f":"CHOOSE(Config!$E$7,M4+1,M4+7,EDATE(M4,1),EDATE(M4,3))","v":"2020-05-31"},{"$f":"CHOOSE(Config!$E$7,N4+1,N4+7,EDATE(N4,1),EDATE(N4,3))","v":"2020-06-07"},{"$f":"CHOOSE(Config!$E$7,O4+1,O4+7,EDATE(O4,1),EDATE(O4,3))","v":"2020-06-14"},{"$f":"CHOOSE(Config!$E$7,P4+1,P4+7,EDATE(P4,1),EDATE(P4,3))","v":"2020-06-21"},{"$f":"CHOOSE(Config!$E$7,Q4+1,Q4+7,EDATE(Q4,1),EDATE(Q4,3))","v":"2020-06-28"},{"$f":"CHOOSE(Config!$E$7,R4+1,R4+7,EDATE(R4,1),EDATE(R4,3))","v":"2020-07-05"},{"$f":"CHOOSE(Config!$E$7,S4+1,S4+7,EDATE(S4,1),EDATE(S4,3))","v":"2020-07-12"},{"$f":"CHOOSE(Config!$E$7,T4+1,T4+7,EDATE(T4,1),EDATE(T4,3))","v":"2020-07-19"},{"$f":"CHOOSE(Config!$E$7,U4+1,U4+7,EDATE(U4,1),EDATE(U4,3))","v":"2020-07-26"},{"$f":"CHOOSE(Config!$E$7,V4+1,V4+7,EDATE(V4,1),EDATE(V4,3))","v":"2020-08-02"},{"$f":"CHOOSE(Config!$E$7,W4+1,W4+7,EDATE(W4,1),EDATE(W4,3))","v":"2020-08-09"},{"$f":"CHOOSE(Config!$E$7,X4+1,X4+7,EDATE(X4,1),EDATE(X4,3))","v":"2020-08-16"},{"$f":"CHOOSE(Config!$E$7,Y4+1,Y4+7,EDATE(Y4,1),EDATE(Y4,3))","v":"2020-08-23"}]
[null,null,"±  Saldos iniciales en cada período",null,{"$f":"SUM('Caja:Banco 5'!E5)","v":1800},{"$f":"SUM('Caja:Banco 5'!F5)","v":2000},{"$f":"SUM('Caja:Banco 5'!G5)","v":2000},{"$f":"SUM('Caja:Banco 5'!H5)","v":2000},{"$f":"SUM('Caja:Banco 5'!I5)","v":2000},{"$f":"SUM('Caja:Banco 5'!J5)","v":2000},{"$f":"SUM('Caja:Banco 5'!K5)","v":2000},{"$f":"SUM('Caja:Banco 5'!L5)","v":2000},{"$f":"SUM('Caja:Banco 5'!M5)","v":2000},{"$f":"SUM('Caja:Banco 5'!N5)","v":2000},{"$f":"SUM('Caja:Banco 5'!O5)","v":2000},{"$f":"SUM('Caja:Banco 5'!P5)","v":2000},{"$f":"SUM('Caja:Banco 5'!Q5)","v":2000},{"$f":"SUM('Caja:Banco 5'!R5)","v":2000},{"$f":"SUM('Caja:Banco 5'!S5)","v":2000},{"$f":"SUM('Caja:Banco 5'!T5)","v":2000},{"$f":"SUM('Caja:Banco 5'!U5)","v":2000},{"$f":"SUM('Caja:Banco 5'!V5)","v":2000},{"$f":"SUM('Caja:Banco 5'!W5)","v":2000},{"$f":"SUM('Caja:Banco 5'!X5)","v":2000},{"$f":"SUM('Caja:Banco 5'!Y5)","v":2000},{"$f":"SUM('Caja:Banco 5'!Z5)","v":2000}]
[null,null,{"$f":"IF(Config!G6<>\"\",Config!G6,\"\")","v":"Flujos de la actividad corriente"},null,{"$f":"SUM('Caja:Banco 5'!E6)","v":200},{"$f":"SUM('Caja:Banco 5'!F6)","v":0},{"$f":"SUM('Caja:Banco 5'!G6)","v":0},{"$f":"SUM('Caja:Banco 5'!H6)","v":0},{"$f":"SUM('Caja:Banco 5'!I6)","v":0},{"$f":"SUM('Caja:Banco 5'!J6)","v":0},{"$f":"SUM('Caja:Banco 5'!K6)","v":0},{"$f":"SUM('Caja:Banco 5'!L6)","v":0},{"$f":"SUM('Caja:Banco 5'!M6)","v":0},{"$f":"SUM('Caja:Banco 5'!N6)","v":0},{"$f":"SUM('Caja:Banco 5'!O6)","v":0},{"$f":"SUM('Caja:Banco 5'!P6)","v":0},{"$f":"SUM('Caja:Banco 5'!Q6)","v":0},{"$f":"SUM('Caja:Banco 5'!R6)","v":0},{"$f":"SUM('Caja:Banco 5'!S6)","v":0},{"$f":"SUM('Caja:Banco 5'!T6)","v":0},{"$f":"SUM('Caja:Banco 5'!U6)","v":0},{"$f":"SUM('Caja:Banco 5'!V6)","v":0},{"$f":"SUM('Caja:Banco 5'!W6)","v":0},{"$f":"SUM('Caja:Banco 5'!X6)","v":0},{"$f":"SUM('Caja:Banco 5'!Y6)","v":0},{"$f":"SUM('Caja:Banco 5'!Z6)","v":0}]
[null,{"$f":"Config!F7","v":1},{"$f":"IF(Config!G7<>\"\",Config!G7,\"\")","v":"Cobros a clientes"},null,{"$f":"SUM('Caja:Banco 5'!E7)","v":1000},{"$f":"SUM('Caja:Banco 5'!F7)","v":0},{"$f":"SUM('Caja:Banco 5'!G7)","v":0},{"$f":"SUM('Caja:Banco 5'!H7)","v":0},{"$f":"SUM('Caja:Banco 5'!I7)","v":0},{"$f":"SUM('Caja:Banco 5'!J7)","v":0},{"$f":"SUM('Caja:Banco 5'!K7)","v":0},{"$f":"SUM('Caja:Banco 5'!L7)","v":0},{"$f":"SUM('Caja:Banco 5'!M7)","v":0},{"$f":"SUM('Caja:Banco 5'!N7)","v":0},{"$f":"SUM('Caja:Banco 5'!O7)","v":0},{"$f":"SUM('Caja:Banco 5'!P7)","v":0},{"$f":"SUM('Caja:Banco 5'!Q7)","v":0},{"$f":"SUM('Caja:Banco 5'!R7)","v":0},{"$f":"SUM('Caja:Banco 5'!S7)","v":0},{"$f":"SUM('Caja:Banco 5'!T7)","v":0},{"$f":"SUM('Caja:Banco 5'!U7)","v":0},{"$f":"SUM('Caja:Banco 5'!V7)","v":0},{"$f":"SUM('Caja:Banco 5'!W7)","v":0},{"$f":"SUM('Caja:Banco 5'!X7)","v":0},{"$f":"SUM('Caja:Banco 5'!Y7)","v":0},{"$f":"SUM('Caja:Banco 5'!Z7)","v":0}]
[null,{"$f":"Config!F8","v":2},{"$f":"IF(Config!G8<>\"\",Config!G8,\"\")","v":"Pagos a proveedores"},null,{"$f":"SUM('Caja:Banco 5'!E8)","v":-2300},{"$f":"SUM('Caja:Banco 5'!F8)","v":0},{"$f":"SUM('Caja:Banco 5'!G8)","v":0},{"$f":"SUM('Caja:Banco 5'!H8)","v":0},{"$f":"SUM('Caja:Banco 5'!I8)","v":0},{"$f":"SUM('Caja:Banco 5'!J8)","v":0},{"$f":"SUM('Caja:Banco 5'!K8)","v":0},{"$f":"SUM('Caja:Banco 5'!L8)","v":0},{"$f":"SUM('Caja:Banco 5'!M8)","v":0},{"$f":"SUM('Caja:Banco 5'!N8)","v":0},{"$f":"SUM('Caja:Banco 5'!O8)","v":0},{"$f":"SUM('Caja:Banco 5'!P8)","v":0},{"$f":"SUM('Caja:Banco 5'!Q8)","v":0},{"$f":"SUM('Caja:Banco 5'!R8)","v":0},{"$f":"SUM('Caja:Banco 5'!S8)","v":0},{"$f":"SUM('Caja:Banco 5'!T8)","v":0},{"$f":"SUM('Caja:Banco 5'!U8)","v":0},{"$f":"SUM('Caja:Banco 5'!V8)","v":0},{"$f":"SUM('Caja:Banco 5'!W8)","v":0},{"$f":"SUM('Caja:Banco 5'!X8)","v":0},{"$f":"SUM('Caja:Banco 5'!Y8)","v":0},{"$f":"SUM('Caja:Banco 5'!Z8)","v":0}]
{"$rows_left_out":68}